store_name,address,address_line_2,city,state,zip_code,store_hours,fax_number,phone_number,website_address,latitude,longitude,country,county,country_code,geo_accuracy
Batteries Plus - 030,1268 S. Robert Street,,West St. Paul,MN,55118,Monday--> 8:00am - 8:00pm |Tuesday--> 8:00am - 8:00pm |Wednesday--> 8:00am - 8:00pm |Thursday--> 8:00am - 8:00pm |Friday--> 8:00am - 8:00pm |Saturday--> 9:00am - 7:00pm |Sunday--> 10:00am - 5:00pm,,,https://www.batteriesplus.com/store-locator/mn/westst-paul/auto-batteries-030,44.90789,-93.080384,United States,Dakota County,US,PREMISE: ROOFTOP
Batteries Plus - 026,1348 Town Centre Drive,,Eagan,MN,55123,Monday--> 8:00am - 8:00pm |Tuesday--> 8:00am - 8:00pm |Wednesday--> 8:00am - 8:00pm |Thursday--> 8:00am - 8:00pm |Friday--> 8:00am - 8:00pm |Saturday--> 8:00am - 7:00pm |Sunday--> 10:00am - 6:00pm,(651) 209-2777,(651) 209-9600,https://www.batteriesplus.com/store-locator/mn/eagan/auto-batteries-026,44.83054827,-93.16369923,United States,Dakota County,US,AGGDATA_VERIFIED: ROOFTOP
Batteries Plus - 017,15445 Cedar Ave,,Apple Valley,MN,55124,Monday--> 8:00am - 8:00pm |Tuesday--> 8:00am - 8:00pm |Wednesday--> 8:00am - 8:00pm |Thursday--> 8:00am - 8:00pm |Friday--> 8:00am - 8:00pm |Saturday--> 8:00am - 7:00pm |Sunday--> 10:00am - 6:00pm,(952) 891-2304,(952) 891-2300,https://www.batteriesplus.com/store-locator/mn/applevalley/auto-batteries-017,44.72580824,-93.21851036,United States,Dakota County,US,AGGDATA_VERIFIED: ROOFTOP
Batteries Plus - 032,1480 Weir Dr,STE 200,Woodbury,MN,55125,Monday--> 8:00am - 8:00pm |Tuesday--> 8:00am - 8:00pm |Wednesday--> 8:00am - 8:00pm |Thursday--> 8:00am - 8:00pm |Friday--> 8:00am - 8:00pm |Saturday--> 9:00am - 7:00pm |Sunday--> 10:00am - 6:00pm,(651) 604-6693,(651) 714-4846,https://www.batteriesplus.com/store-locator/mn/woodbury/auto-batteries-032,44.92816926581345,-92.97075962645977,United States,Washington County,US,AGGDATA_VERIFIED: ROOFTOP
Batteries Plus - 025,13650 Grove Drive,,Maple Grove,MN,55311,Monday--> 8:00am - 6:00pm |Tuesday--> 8:00am - 6:00pm |Wednesday--> 8:00am - 6:00pm |Thursday--> 8:00am - 6:00pm |Friday--> 8:00am - 6:00pm |Saturday--> 8:00am - 6:00pm |Sunday--> 10:00am - 6:00pm,(763) 416-9988,(763) 416-9933,https://www.batteriesplus.com/store-locator/mn/maplegrove/auto-batteries-025,45.10471416,-93.45313078,United States,Hennepin County,US,AGGDATA_VERIFIED: ROOFTOP
Batteries Plus - 033,18180 Zane Street NW,,Elk River,MN,55330,Monday--> 8:00am - 8:00pm |Tuesday--> 8:00am - 8:00pm |Wednesday--> 8:00am - 8:00pm |Thursday--> 8:00am - 8:00pm |Friday--> 8:00am - 8:00pm |Saturday--> 9:00am - 7:00pm |Sunday--> 9:00am - 5:00pm,(651) 604-6693,(763) 274-2175,https://www.batteriesplus.com/store-locator/mn/elkriver/auto-batteries-033,45.30031737732104,-93.55255497618943,United States,Sherburne County,US,AGGDATA_VERIFIED: ROOFTOP
Batteries Plus - 020,952 Prairie Center Drive,,Eden Prairie,MN,55344,Monday--> 8:00am - 8:00pm |Tuesday--> 8:00am - 8:00pm |Wednesday--> 8:00am - 8:00pm |Thursday--> 8:00am - 8:00pm |Friday--> 8:00am - 8:00pm |Saturday--> 8:00am - 7:00pm |Sunday--> 10:00am - 6:00pm,(952) 259-0002,(952) 259-0000,https://www.batteriesplus.com/store-locator/mn/edenprairie/auto-batteries-020,44.86471455721979,-93.44087265431313,United States,Hennepin County,US,AGGDATA_VERIFIED: ROOFTOP
Batteries Plus - 018,5717 Excelsior Blvd,,St Louis Park,MN,55416,Monday--> 8:00am - 8:00pm |Tuesday--> 8:00am - 8:00pm |Wednesday--> 8:00am - 8:00pm |Thursday--> 8:00am - 8:00pm |Friday--> 8:00am - 8:00pm |Saturday--> 8:00am - 7:00pm |Sunday--> 10:00am - 6:00pm,(952) 929-4821,(952) 929-6699,https://www.batteriesplus.com/store-locator/mn/stlouispark/auto-batteries-018,44.92904453272384,-93.35276514293356,United States,Hennepin County,US,AGGDATA_VERIFIED: ROOFTOP
Batteries Plus - 016,9840 Lyndale Ave South,,Bloomington,MN,55420,Monday--> 8:00am - 8:00pm |Tuesday--> 8:00am - 8:00pm |Wednesday--> 8:00am - 8:00pm |Thursday--> 8:00am - 8:00pm |Friday--> 8:00am - 8:00pm |Saturday--> 8:00am - 7:00pm |Sunday--> 10:00am - 6:00pm,(952) 881-3613,(952) 881-0747,https://www.batteriesplus.com/store-locator/mn/bloomington/auto-batteries-016,44.82540706724651,-93.28950002789499,United States,Hennepin County,US,AGGDATA_VERIFIED: ROOFTOP
Batteries Plus - 048,3193 Northdale Blvd.,,Coon Rapids,MN,55433,Monday--> 9:00am - 7:00pm |Tuesday--> 9:00am - 7:00pm |Wednesday--> 9:00am - 7:00pm |Thursday--> 9:00am - 7:00pm |Friday--> 9:00am - 7:00pm |Saturday--> 9:00am - 7:00pm |Sunday--> 10:00am - 5:00pm,(651) 604-6693,(763) 331-3700,https://www.batteriesplus.com/store-locator/mn/coonrapids/auto-batteries-048,45.1970232,-93.345761,United States,Anoka County,US,STREET_ADDRESS: ROOFTOP
