distributor_name,address,city,state,zip_code,phone_number,fax_number,email_address,website_address,brands,service_hours,showroom_hours,country_code,county,latitude,longitude,country,geo_accuracy
Nelson's Speed Shop,4566 N. Greenville Rd.,Greenville,MI,48838,(616) 754-9185,(616) 754-5780,info@nelsonsspeedshop.com,http://www.nelsonsspeedshop.com/shop-brp,canam|skidoo|seadoo,,Monday: 09:00-17:30|Tuesday: 09:00-17:30|Wednesday: 09:00-17:30|Thursday: 09:00-17:30|Friday: 09:00-15:00|Saturday: 00:00-00:00|Sunday: 09:00-17:30,US,Montcalm County,43.227389060124,-85.2533932775259,United States,AGGDATA_VERIFIED: ROOFTOP
Inland Marine,333 S Main St,Au Gres,MI,48703,(989) 876-7185,(989) 876-7103,inland@inlandmarineinc.com,http://www.inlandmarineinc.com,evinrude,,Monday: 08:30-17:00|Tuesday: 08:30-17:00|Wednesday: 08:30-17:00|Thursday: 08:30-17:00|Friday: 08:30-13:00|Saturday: 00:00-00:00|Sunday: 08:30-17:00,US,Arenac County,44.0448589,-83.68516,United States,PREMISE: ROOFTOP
Wonderland Marine West Inc,5796 E Grand River Ave,Howell,MI,48843,(517) 548-5122,(517) 548-5360,pmitter@wonderlandmarinewest.com,http://www.wonderlandmarinewest.com,evinrude,,Monday: 09:00-20:00|Tuesday: 09:00-20:00|Wednesday: 09:00-20:00|Thursday: 09:00-20:00|Friday: 09:00-17:00|Saturday: 00:00-00:00|Sunday: 09:00-20:00,US,Livingston County,42.574069,-83.837358,United States,PREMISE: ROOFTOP
Us 27 Motorsports & Trailers,5301 North Us 27,Saint Johns,MI,48879,(866) 554-4217,(989) 224-4907,sales@us27motorsports.com,http://www.us27motorsports.com,canam|skidoo|seadoo,Monday: 09:00-18:00|Tuesday: 09:00-18:00|Wednesday: 09:00-18:00|Thursday: 09:00-19:00|Friday: 09:00-15:00|Saturday: 00:00-00:00|Sunday: 09:00-18:00,Monday: 09:00-18:00|Tuesday: 09:00-18:00|Wednesday: 09:00-18:00|Thursday: 09:00-18:00|Friday: 09:00-15:00|Saturday: 00:00-00:00|Sunday: 09:00-18:00,US,Clinton County,43.06346425,-84.56497709,United States,AGGDATA_VERIFIED: ROOFTOP
Leaders Rpm,8500 W. Main St.,Kalamazoo,MI,49009,(269) 544-2628,(269) 372-4963,mresh@leadersmarine.com,http://www.leadersrpm.com/shop-brp,canam|skidoo|seadoo,Monday: 09:00-18:00|Tuesday: 09:00-18:00|Wednesday: 09:00-18:00|Thursday: 09:00-18:00|Friday: 09:00-14:00|Saturday: 00:00-00:00|Sunday: 09:00-18:00,Monday: 09:00-18:00|Tuesday: 09:00-18:00|Wednesday: 09:00-18:00|Thursday: 09:00-18:00|Friday: 09:00-14:00|Saturday: 00:00-00:00|Sunday: 09:00-18:00,US,Kalamazoo County,42.296514154368246,-85.71717588230969,United States,AGGDATA_VERIFIED: ROOFTOP
Planet Powersports,647 E. Chicago Rd.,Coldwater,MI,49036,(517) 278-5557,(517) 278-6576,oem-info@planet-powersports.net,http://www.planet-powersports.com/,canam|skidoo,Monday: 09:00-18:00|Tuesday: 10:00-20:00|Wednesday: 09:00-18:00|Thursday: 09:00-18:00|Friday: 09:00-18:00|Saturday: 00:00-00:00|Sunday: 00:00-00:00,Monday: 09:00-18:00|Tuesday: 09:00-18:00|Wednesday: 09:00-18:00|Thursday: 09:00-18:00|Friday: 10:00-16:00|Saturday: 00:00-00:00|Sunday: 00:00-00:00,US,Branch County,41.93607203844235,-84.95438162237406,United States,AGGDATA_VERIFIED: ROOFTOP
Finn & Feather Marine,34 N Unionville Rd,Bay Port,MI,48720,(989) 656-3341,(989) 656-3341,starship_1@sbcglobal.net,,evinrude,,Monday: 08:30-17:00|Tuesday: 08:30-17:00|Wednesday: 08:30-17:00|Thursday: 08:30-17:00|Friday: 08:30-12:00|Saturday: 00:00-00:00|Sunday: 08:30-17:00,US,Huron County,43.8293902,-83.3772937,United States,STREET_ADDRESS: ROOFTOP
"Town & Country Sports Center, Inc.",18655 Us 12,Cement City,MI,49233,(517) 547-3333,(517) 547-4053,scott@ebikerhq.com,http://www.cementcityharley.com,canam,,,US,Lenawee County,42.04785459699102,-84.35628354549408,United States,AGGDATA_VERIFIED: ROOFTOP
Rhynard's Pontoon Co,1380 Greenville Rd,Greenville,MI,48838,(616) 754-7634,(616) 754-2580,mandrews@auis.net,,evinrude,,,US,Montcalm County,43.191826,-85.2525891,United States,STREET_ADDRESS: RANGE_INTERPOLATED
"Lakeside Motor Sports, Inc.",10964 90Th Avenue,Mecosta,MI,49332,(231) 972-4146,(231) 972-4211,danielle@lakesidemotorsports.net,http://www.lakesidemotorsports.net/shop-brp,canam|skidoo|seadoo,Monday: 09:00-17:30|Tuesday: 09:00-17:30|Wednesday: 09:00-17:30|Thursday: 09:00-17:30|Friday: 09:00-16:00|Saturday: 00:00-00:00|Sunday: 09:00-17:30,Monday: 09:00-17:30|Tuesday: 09:00-17:30|Wednesday: 09:00-17:30|Thursday: 09:00-17:30|Friday: 09:00-16:00|Saturday: 10:00-14:00|Sunday: 09:00-17:30,US,Mecosta County,43.62601591,-85.26452579,United States,AGGDATA_VERIFIED: ROOFTOP
