distributor_name,address,city,state,zip_code,phone_number,fax_number,email_address,store_hours,country,country_code,latitude,longitude,county,geo_accuracy
Alaska Rubber Group,5811 Old Seward Highway,Anchorage,AK,99518,(907) 562-2200,(907) 561-7600,,M-F 8am to 5pm & Sat. 9am to 1pm,United States,US,61.168054,-149.867757,Anchorage Municipality,PREMISE: ROOFTOP
Alaska Rubber Group,43640 Kenai Spur,Kenai,AK,99611,(907) 395-0575,,,M-F 8am to 5pm,United States,US,60.612669,-151.333715,Kenai Peninsula Borough,PREMISE: ROOFTOP
Seattle Marine And Fishing Supply Co.,Po Box 352,Nadnek,AK,99633,(800) 426-2783,,,,United States,US,58.729871,-157.007142,Bristol Bay,PREMISE: ROOFTOP
Alaska Rubber Group,651 E Railroad Ave,Wasilla,AK,99654,(907) 373-1345,(907) 373-1344,,M-F 8am to 5pm,United States,US,61.57987,-149.433787,Matanuska-Susitna Borough,PREMISE: ROOFTOP
Alaska Rubber Group,210 E. Van Horn Road,Fairbanks,AK,99701,,,,,United States,US,64.813386,-147.704427,Fairbanks North Star Borough,PREMISE: ROOFTOP
The Rigging Box,8180 Newington Road,Lorton,VA,22079,(703) 339-7575,(703) 339-0015,selina@theriggingbox.com,6:00am to 4:00pm,United States,US,38.735387,-77.184378,Fairfax County,PREMISE: ROOFTOP
"Alloy Sling Chain Iindustries, Ltd",1406 West 175Th St,East Hazelcrest,IL,60429,(708) 647-4900,(708) 647-4993,,,United States,US,41.572111,-87.65123,Cook County,PREMISE: ROOFTOP
Construction Safety Products,359 Mt. Zion Road,Shreveport,LA,71106,(318) 688-6483,(318) 688-6487,sales@cspforestry.com,8:00-5:00,United States,US,32.412386,-93.759401,Caddo Parish,PREMISE: ROOFTOP
"St. Pierre Chains & Slings, Ltd.",7690 Jarry Street E,Montreal,QC,H1J 2M3,(514) 354-4219,(514) 354-5059,contact@st-pierre.qc.ca,8 AM - 5 PM,Canada,CA,45.6078261,-73.56930799999999,Communauté-Urbaine-de-Montréal,PREMISE: ROOFTOP
Unalloy Canada,131 Rue Barr,Ville St. Laurent,QC,H4T 1W6,(514) 735-7504,,,,Canada,CA,45.4810838,-73.6914091,Communauté-Urbaine-de-Montréal,STREET_ADDRESS: ROOFTOP
