store_name,address,address_line_2,address_line_3,city,state,zip_code,phone_number,country,latitude,longitude,store_hours,type,store_number,country_code,county,geo_accuracy
Cellarbrations At Cottesloe,"Shop 4 & 5, 460 Stirling Hwy",Primewest Cottesloe Central,,Peppermint Grove,WA,6011,(08) 9385 0788,Australia,-31.9979075,115.7676909,Mon: 9am-7pm ; Tue: 9am-7pm ; Wed: 9am-7pm ; Thu: 9am-7pm ; Fri: 9am-7pm ; Sat: 9am-5pm ; Sun: 11am-5pm,Regular,46028,AU,CURTIN,LOCALITY: APPROXIMATE
Cellarbrations At Erindale,50 Denigan St,Unit 1,,Wanniassa,ACT,2903,(02) 6296 3122,Australia,-35.4038507,149.0965124,Mon: 10am-9pm ; Tue: 10am-9pm ; Wed: 10am-9pm ; Thu: 10am-9pm ; Fri: 10am-11pm ; Sat: 9am-11pm ; Sun: 10am-9pm,Regular,62943,AU,CANBERRA,SUBPREMISE: ROOFTOP
Cellarbrations At Fortitude Valley,Home Maker Centre,650 Wickham St,Next To Aldi,Fortitude Valley,QLD,4006,0422 046 589,Australia,-27.450042,153.040508,Mon: 10am-7pm ; Tues: 10am-7pm ; Wed: 10am-7pm ; Thurs: 10am-7pm ; Fri: 10am-8pm ; Sat: 10am-7pm ; Sun: 10am-5pm,Regular,258327,AU,BRIS CITY CNTRY,PREMISE: ROOFTOP
Cellarbrations At Birtinya,Stockland Birtinya Shopping Centre,"Shop 15 , 8 The Avenue",Cnr Kawana Way,Birtinya,QLD,4575,(07) 5329 4777,Australia,-26.7397384,153.1164346,Mon: 10am - 8pm  ; Tue: 10am - 8pm  ; Wed: 10am - 8pm  ; Thu: 10am - 8pm  ; Fri: 10am - 8pm  ; Sat: 10am - 8pm  ; Sun: 10am - 8pm,Regular,208529,AU,SUNSHINE MT ISA,PREMISE: ROOFTOP
Cellarbrations At Top Drops Rossmore,832-850 Bringelly Rd,Shop 1,,Rossmore,NSW,2557,(02) 9606 6476,Australia,-33.9455513,150.7712361,Mon: 9am-8pm ; Tue: 9am-8pm ; Wed: 9am-8pm ; Thu: 9am-8pm ; Fri: 9am-8pm ; Sat: 9am-8pm ; Sun: 10am-8pm,Regular,234819,AU,CAMPBELLTOWN,SUBPREMISE: ROOFTOP
Cellarbrations At Brightwater Shopping Centre,Brightwater Shopping Centre,69 Attenuata Dr,Shop 4,Mountain Creek,QLD,4557,(07) 5437 8644,Australia,-26.7104873,153.1087081,Mon: 9am - 8pm  ; Tue: 9am - 8pm  ; Wed: 9am - 8pm  ; Thu: 9am - 10pm ; Fri: 9am - 10pm ; Sat: 9am - 10pm ; Sun: 9am - 8pm,Regular,123012,AU,SUNSHINE MT ISA,SUBPREMISE: ROOFTOP
Cellarbrations At Georgetown,14 Moate St,,,Georgetown,NSW,2298,(02) 4968 2038,Australia,-32.9083524,151.7301162,Mon: 9am-9pm ; Tue: 9am-9pm ; Wed: 9am-9pm ; Thu: 9am-9pm ; Fri: 9am-9:30pm ; Sat: 9am-9:30pm ; Sun: 10am-8:30pm,Regular,3432,AU,HUNTER,PREMISE: ROOFTOP
Cellarbrations At Kotara,Unit 4,154 Park Avenue,,Kotara,NSW,2289,(02) 4957 1433,Australia,-32.9408265,151.7050466,Mon: 10am-6pm ; Tue: 10am-6pm ; Wed: 10am-6pm ; Thu: 10am-7pm ; Fri: 10am-7pm ; Sat: 10am-7pm ; Sun: 11am-4pm,Regular,44981,AU,HUNTER,SUBPREMISE: ROOFTOP
Cellarbrations At Kenthurst,Shop 1,4 Nelson St,,Kenthurst,NSW,2156,(02) 9654 2004,Australia,-33.6609031,151.0060022,Mon: 8am-7.30pm ; Tue: 8am-7.30pm ; Wed: 8am-7.30pm ; Thu: 8am-7.30pm ; Fri: 8am-8pm ; Sat: 8am-8pm ; Sun: 8am-6pm; Contact Store For Public Holiday Trading Hours,Regular,230221,AU,RICHMOND,SUBPREMISE: ROOFTOP
Cellarbrations At Nardis Newcomb,26/27-37 Bellarine Highway,,,Newcomb,VIC,3219,(03) 52 483 777,Australia,-38.1692883,144.3894597,Mon 9am - 7pm; Tues 9am - 7pm; Wed 9am - 7pm; Thurs 9am - 7pm; Fri 9am - 7pm; Sat 9am - 7pm; Sun Closed,Regular,36960,AU,VIC COUNTRY,SUBPREMISE: ROOFTOP
