store_name,store_type,address,address_line_2,city,state,zip_code,phone_number,lobby_hours,drive_thru_hours,latitude,longitude,country,country_code,county,geo_accuracy
Nolensville Atm,Atm,7116 Nolensville Road,Suite 701,Nolensville,TN,37135,(615) 550-2225,,,35.974934,-86.676163,United States,US,Williamson,PREMISE: ROOFTOP
Spring Hill,Branch,2035 Wall St,,Spring Hill,TN,37174,(615) 302-3905,M-Th 8:30-4:00 F 8:30-5:00,M-Th 8:30-5:00 F 8:30-6:00,35.772692,-86.915168,United States,US,Williamson,PREMISE: ROOFTOP
Spring Hill Drive Up Atm,Atm,2035 Wall St,,Spring Hill,TN,37174,(615) 302-3905,,,35.772692,-86.915168,United States,US,Williamson,PREMISE: ROOFTOP
Georgetown,Branch,3795 Georgetown Rd,,Cleveland,TN,37312,(423) 303-1757,M-Th 8:30-4:00 F 8:30-5:00,M-Th 8:30-5:00 F 8:30-6:00,35.2078542,-84.886879,United States,US,Bradley,PREMISE: ROOFTOP
Keith Street,Branch,3020 Keith St Nw,,Cleveland,TN,37312,(423) 473-7980,M-Th 8:30-4:00 F 8:30-5:00,M-Th 8:30-5:00 F 8:30-6:00,35.1886345,-84.8678278,United States,US,Bradley,PREMISE: ROOFTOP
Georgetown Drive Up Atm,Atm,3795 Georgetown Rd,,Cleveland,TN,37312,(423) 303-1757,,,35.2078542,-84.886879,United States,US,Bradley,PREMISE: ROOFTOP
Keith Street Drive Up Atm,Atm,3020 Keith St Nw,,Cleveland,TN,37312,(423) 473-7980,,,35.1886345,-84.8678278,United States,US,Bradley,PREMISE: ROOFTOP
Bradley Place Executive Plaza Atm,Atm,1510 Stuart Rd Ne,,Cleveland,TN,37312,,,,35.1864864,-84.82632459999999,United States,US,Bradley,PREMISE: ROOFTOP
Waterville Springs,Branch,2530 Dalton Pike Se,,Cleveland,TN,37323,(423) 303-1756,M-Th 8:30-4:00 F 8:30-5:00,M-Th 8:30-5:00 F 8:30-6:00,35.12826930000001,-84.8669321,United States,US,Bradley,PREMISE: ROOFTOP
Waterville Springs Drive Up Atm,Atm,2530 Dalton Pike Se,,Cleveland,TN,37323,(423) 303-1756,,,35.12826930000001,-84.8669321,United States,US,Bradley,PREMISE: ROOFTOP
