store_name,address,city,state,zip_code,country,phone_number,website_address,check_in,check_out,country_code,county,latitude,longitude,geo_accuracy
Sanibel Cottages Resort,2341 West Gulf Drive,Sanibel Island,FL,33957,United States,1(239) 472-1868,https://www.hiltongrandvacations.com/en/resorts-and-destinations/florida/gulf/sanibel-cottages-resort,3:00 P.m.,10:00 A.m.,US,Lee,26.423233,-82.076111,PREMISE: ROOFTOP
Shell Island Beach Club Resort,255 Periwinkle Way,Sanibel Island,FL,33957,United States,1(239) 472-4497,https://www.hiltongrandvacations.com/en/resorts-and-destinations/florida/gulf/shell-island-beach-club-resort,3:00 P.m.,10:00 A.m.,US,Lee,26.45095,-82.017505,PREMISE: ROOFTOP
Tortuga Beach Club Resort,959 East Gulf Drive,Sanibel Island,FL,33957,United States,1(239) 472-0400,https://www.hiltongrandvacations.com/en/resorts-and-destinations/florida/gulf/tortuga-beach-club-resort,3:00 P.m.,10:00 A.m.,US,Lee,26.438987,-82.039208,PREMISE: ROOFTOP
Charter Club Resort Of Naples Bay,1000 10th Avenue South,Naples,FL,34102,United States,(239) 261-5559,https://www.hiltongrandvacations.com/en/resorts-and-destinations/florida/gulf/charter-club-resort-of-naples-bay,,,US,Collier,26.136283,-81.792515,PREMISE: ROOFTOP
Club Regency Of Marco Island,500 South Collier Boulevard,Marco Island,FL,34145,United States,1(239) 394-8197,https://www.hiltongrandvacations.com/en/resorts-and-destinations/florida/gulf/club-regency-of-marco-island,4:00 P.m.,10:00 A.m.,US,Collier,25.92545,-81.72737,PREMISE: ROOFTOP
Eagle's Nest Beach Resort,410 South Collier Boulevard,Marco Island,FL,34145,United States,1(239) 394-5167,https://www.hiltongrandvacations.com/en/resorts-and-destinations/florida/gulf/eagles-nest-beach-resort,3:00 P.m.,10:00 A.m.,US,Collier,25.92631,-81.72756,PREMISE: ROOFTOP
Sunset Cove Resort,571 West Elkcam Circle,Marco Island,FL,34145,United States,1(239) 393-3460,https://www.hiltongrandvacations.com/en/resorts-and-destinations/florida/gulf/sunset-cove-resort,4:00 P.m.,10:00 A.m.,US,Collier,25.95134,-81.72721,PREMISE: ROOFTOP
The Charter Club Of Marco Beach,700 South Collier Boulevard,Marco Island,FL,34145,United States,1(239) 394-4192,https://www.hiltongrandvacations.com/en/resorts-and-destinations/florida/gulf/the-charter-club-of-marco-beach,3:00 P.m.,10:00 A.m.,US,Collier,25.919627,-81.726304,PREMISE: ROOFTOP
The Surf Club Of Marco,540 South Collier Boulevard,Marco Island,FL,34145,United States,1(239) 642-5800,https://www.hiltongrandvacations.com/en/resorts-and-destinations/florida/gulf/the-surf-club-of-marco,3:00 P.m.,10:00 A.m.,US,Collier,25.923292,-81.726895,PREMISE: ROOFTOP
Barefoot'n Resort,2754 Florida Plaza Boulevard,Kissimmee,FL,34746,United States,(407) 589-2127,https://www.hiltongrandvacations.com/en/resorts-and-destinations/florida/central/barefootn-resort,,,US,Osceola,28.328761,-81.517486,PREMISE: ROOFTOP
