store_name,address,city,state,zip_code,phone_number,fax_number,lobby_hours,drive_thru_hours,latitude,longitude,country,county,country_code,geo_accuracy
Lake Charles,2089 Country Club Road,Lake Charles,LA,70605,(337) 656-6190,(337) 478-4833,Monday- Friday: 8:30 am - 5:00 pm,,30.1682443,-93.25290179999999,United States,Calcasieu Parish,US,PREMISE: ROOFTOP
Denham Springs,482 S. Range Ave.,Denham Springs,LA,70726,(225) 300-8550,(225) 300-8551,Monday- Friday: 8:30 am - 5:00 pm,,30.478952,-90.955325,United States,Livingston Parish,US,PREMISE: ROOFTOP
Gonzales,525 E. New River St.,Gonzales,LA,70737,(225) 227-2320,(225) 450-1762,Monday - Friday: 8:30 a.m. - 5 p.m.,,30.2396368,-90.9157829,United States,Ascension Parish,US,PREMISE: ROOFTOP
Jackson,1542 Charter Street,Jackson,LA,70748,(225) 634-7741,(225) 634-2066,Monday-Friday 8:30 - 5:00 pm,"Monday-Friday 8:00 am - 5:00 pm, Saturday 9:00 am - 12:00 pm",30.837182,-91.217044,United States,East Feliciana Parish,US,PREMISE: ROOFTOP
Port Allen,3761 LA Highway 1 South,Port Allen,LA,70767,(225) 448-5483,(225) 454-6724,Monday- Friday: 8:30 am - 5:00 pm,,30.4197385,-91.2201848,United States,West Baton Rouge Parish,US,STREET_ADDRESS: RANGE_INTERPOLATED
St. Francisville,7370 US-61,St. Francisville,LA,70775,(225) 635-3367,(225) 635-5468,Monday-Friday 8:30 am – 5:00 pm,Monday-Friday 8:00 am – 5:00 pm,30.793985,-91.380443,United States,West Feliciana Parish,US,PREMISE: ROOFTOP
Slaughter,137 Hwy. 19,Slaughter,LA,70777,(225) 654-0314,(225) 654-9121,Monday-Friday 8:30 am – 5:00 pm,Monday-Friday 8:00 am – 5:00 pm,30.7098163,-91.1440358,United States,East Feliciana Parish,US,PREMISE: ROOFTOP
Baton Rouge - Harding Blvd.,3636 Harding Blvd.,Baton Rouge,LA,70807,,,,,30.521062,-91.154466,United States,East Baton Rouge Parish,US,PREMISE: ROOFTOP
Baton Rouge - Perkins,7244 Perkins Rd.,Baton Rouge,LA,70808,(225) 448-5451,(225) 300-8527,Monday- Friday: 8:30 am - 5:00 pm,,30.39728,-91.114193,United States,East Baton Rouge Parish,US,PREMISE: ROOFTOP
Baton Rouge - Highland,18101 Highland Market Dr.,Baton Rouge,LA,70810,(225) 227-2300,(225) 663-6720,"Monday- Friday: 8:30 am - 5:00 pm, Saturday 9:00 am - 12:00 pm",,30.349509,-91.025741,United States,East Baton Rouge Parish,US,PREMISE: ROOFTOP
