﻿store_name,address,address_line_2,city,state,zip_code,phone_number,lobby_hours,drive_up_hours,services,website_address,country,country_code,county,latitude,longitude,geo_accuracy
Spotswood Branch,520 Main Street,,Spotswood,NJ,08884,(732) 251-5300,Monday 9:00 AM - 5:00 PM Tuesday 9:00 AM - 5:00 PM Wednesday 9:00 AM - 5:00 PM Thursday 9:00 AM - 5:00 PM Friday 9:00 AM - 5:00 PM Saturday 9:00 AM - 12:00 PM Sunday CLOSED,Monday 9:00 AM - 5:00 PM Tuesday 9:00 AM - 5:00 PM Wednesday 9:00 AM - 5:00 PM Thursday 9:00 AM - 5:00 PM Friday 9:00 AM - 5:00 PM Saturday 9:00 AM - 12:00 PM Sunday CLOSED,Atm Coin Counting Notary Service Wire Transfer,https://www.kearnybank.com/branch-locations/new-jersey/middlesex-county/spotswood-branch,United States,US,Middlesex,40.391969,-74.390244,PREMISE: ROOFTOP
Belmar Branch,611 Main Street,,Belmar,NJ,07719,(732) 280-5400,Monday 9:00 AM - 5:00 PM Tuesday 9:00 AM - 5:00 PM Wednesday 9:00 AM - 5:00 PM Thursday 9:00 AM - 5:00 PM Friday 9:00 AM - 5:00 PM Saturday 9:00 AM - 12:00 PM Sunday CLOSED,Monday 9:00 AM - 5:00 PM Tuesday 9:00 AM - 5:00 PM Wednesday 9:00 AM - 5:00 PM Thursday 9:00 AM - 5:00 PM Friday 9:00 AM - 5:00 PM Saturday 9:00 AM - 12:00 PM Sunday CLOSED,Atm Safe Deposit Box Night Depository Coin Counting Notary Service Wire Transfer,https://www.kearnybank.com/branch-locations/new-jersey/monmouth-county/belmar-branch,United States,US,Monmouth,40.182871,-74.025101,PREMISE: ROOFTOP
Bradley Beach Branch,501 Main Street,,Bradley Beach,NJ,07720,(732) 775-0600,Monday 9:00 AM - 5:00 PM Tuesday 9:00 AM - 5:00 PM Wednesday 9:00 AM - 5:00 PM Thursday 9:00 AM - 5:00 PM Friday 9:00 AM - 5:00 PM Saturday 9:00 AM - 12:00 PM Sunday CLOSED,Monday 9:00 AM - 5:00 PM Tuesday 9:00 AM - 5:00 PM Wednesday 9:00 AM - 5:00 PM Thursday 9:00 AM - 5:00 PM Friday 9:00 AM - 5:00 PM Saturday 9:00 AM - 12:00 PM Sunday CLOSED,Atm Safe Deposit Box Night Depository Coin Counting Notary Service Wire Transfer,https://www.kearnybank.com/branch-locations/new-jersey/monmouth-county/bradley-beach-branch,United States,US,Monmouth,40.202497,-74.018492,PREMISE: ROOFTOP
Little Silver Branch,700 Branch Avenue,,Little Silver,NJ,07739,(732) 933-3500,Monday 9:00 AM - 5:00 PM Tuesday 9:00 AM - 5:00 PM Wednesday 9:00 AM - 5:00 PM Thursday 9:00 AM - 5:00 PM Friday 9:00 AM - 5:00 PM Saturday 9:00 AM - 12:00 PM Sunday CLOSED,Monday 9:00 AM - 5:00 PM Tuesday 9:00 AM - 5:00 PM Wednesday 9:00 AM - 5:00 PM Thursday 9:00 AM - 5:00 PM Friday 9:00 AM - 5:00 PM Saturday 9:00 AM - 12:00 PM Sunday CLOSED,Atm Safe Deposit Box Night Depository Coin Counting Notary Service Wire Transfer,https://www.kearnybank.com/branch-locations/new-jersey/monmouth-county/little-silver-branch,United States,US,Monmouth,40.327389,-74.041024,PREMISE: ROOFTOP
Long Branch Branch,627 Second Avenue,,Long Branch,NJ,07740,(732) 571-1300,Monday 9:00 AM - 5:00 PM Tuesday 9:00 AM - 5:00 PM Wednesday 9:00 AM - 5:00 PM Thursday 9:00 AM - 5:00 PM Friday 9:00 AM - 5:00 PM Saturday 9:00 AM - 12:00 PM Sunday CLOSED,Monday 9:00 AM - 5:00 PM Tuesday 9:00 AM - 5:00 PM Wednesday 9:00 AM - 5:00 PM Thursday 9:00 AM - 5:00 PM Friday 9:00 AM - 5:00 PM Saturday 9:00 AM - 12:00 PM Sunday CLOSED,Atm Safe Deposit Box Night Depository Coin Counting Notary Service Wire Transfer,https://www.kearnybank.com/branch-locations/new-jersey/monmouth-county/long-branch-branch,United States,US,Monmouth,40.283994,-73.985977,PREMISE: ROOFTOP
Neptune City Branch,300 West Sylvania Avenue,,Neptune City,NJ,07753,(732) 774-3636,Monday 9:00 AM - 5:00 PM Tuesday 9:00 AM - 5:00 PM Wednesday 9:00 AM - 5:00 PM Thursday 9:00 AM - 5:00 PM Friday 9:00 AM - 5:00 PM Saturday 9:00 AM - 12:00 PM Sunday CLOSED,Monday 9:00 AM - 5:00 PM Tuesday 9:00 AM - 5:00 PM Wednesday 9:00 AM - 5:00 PM Thursday 9:00 AM - 5:00 PM Friday 9:00 AM - 5:00 PM Saturday 9:00 AM - 12:00 PM Sunday CLOSED,Atm Safe Deposit Box Night Depository Coin Counting Notary Service Wire Transfer,https://www.kearnybank.com/branch-locations/new-jersey/monmouth-county/neptune-city-branch,United States,US,Monmouth,40.205728,-74.046754,PREMISE: ROOFTOP
Oakhurst Branch,1903 Highway 35,,Oakhurst,NJ,07755,(732) 663-4004,Monday 9:00 AM - 5:00 PM Tuesday 9:00 AM - 5:00 PM Wednesday 9:00 AM - 5:00 PM Thursday 9:00 AM - 5:00 PM Friday 9:00 AM - 5:00 PM Saturday 9:00 AM - 12:00 PM Sunday CLOSED,Monday 9:00 AM - 5:00 PM Tuesday 9:00 AM - 5:00 PM Wednesday 9:00 AM - 5:00 PM Thursday 9:00 AM - 5:00 PM Friday 9:00 AM - 5:00 PM Saturday 9:00 AM - 12:00 PM Sunday CLOSED,Atm Safe Deposit Box Night Depository Coin Counting Notary Service Wire Transfer,https://www.kearnybank.com/branch-locations/new-jersey/monmouth-county/oakhurst-branch,United States,US,Monmouth,40.262016,-74.040915,PREMISE: ROOFTOP
Ocean Grove Branch,61 Main Avenue,,Ocean Grove,NJ,07756,(732) 775-0100,Monday 9:00 AM - 5:00 PM Tuesday 9:00 AM - 5:00 PM Wednesday 9:00 AM - 5:00 PM Thursday 9:00 AM - 5:00 PM Friday 9:00 AM - 5:00 PM Saturday 9:00 AM - 12:00 PM Sunday CLOSED,,Atm Safe Deposit Box Night Depository Coin Counting Notary Service Wire Transfer,https://www.kearnybank.com/branch-locations/new-jersey/monmouth-county/ocean-grove,United States,US,Monmouth,40.212467,-74.007252,PREMISE: ROOFTOP
Sea Girt Branch,Sea Girt Plaza,2200 State Highway 35,Manasquan,NJ,08736,(732) 292-1600,Monday 9:00 AM - 5:00 PM Tuesday 9:00 AM - 5:00 PM Wednesday 9:00 AM - 5:00 PM Thursday 9:00 AM - 5:00 PM Friday 9:00 AM - 5:00 PM Saturday 9:00 AM - 12:00 PM Sunday CLOSED,Monday 9:00 AM - 5:00 PM Tuesday 9:00 AM - 5:00 PM Wednesday 9:00 AM - 5:00 PM Thursday 9:00 AM - 5:00 PM Friday 9:00 AM - 5:00 PM Saturday 9:00 AM - 12:00 PM Sunday CLOSED,Atm Safe Deposit Box Night Depository Coin Counting Notary Service Wire Transfer,https://www.kearnybank.com/branch-locations/new-jersey/monmouth-county/sea-girt-branch,United States,US,Monmouth,40.135099,-74.063222,PREMISE: ROOFTOP
Spring Lake Heights Branch,700 Allaire Road,,Spring Lake Heights,NJ,07762,(732) 974-9800,,,Atm Safe Deposit Box Night Depository Coin Counting Notary Service Wire Transfer,https://www.kearnybank.com/branch-locations/new-jersey/monmouth-county/spring-lake-heights-branch,United States,US,Monmouth,40.158848,-74.035862,PREMISE: ROOFTOP
