store_name,address,address_line_2,city,state,zip_code,phone_number,lobby_hours,drive_thru_hours,website_address,country,country_code,county,latitude,longitude,geo_accuracy
Northern Trust Jacksonville,1 Independent Drive,Suite 3250,Jacksonville,FL,32202,(904) 371-3750,,,Https://locations.northerntrust.com/us/fl/jacksonville/1-independent-drive,United States,US,Duval,30.32523,-81.65816,PREMISE: ROOFTOP
Northern Trust Vero Beach,755 Beachland Boulevard,,Vero Beach,FL,32963,(772) 492-1100,Monday 8:30 AM - 4:00 PM Tuesday 8:30 AM - 4:00 PM Wednesday 8:30 AM - 4:00 PM Thursday 8:30 AM - 4:00 PM Friday 8:30 AM - 4:00 PM Saturday Closed Sunday Closed,Monday 8:30 AM - 4:00 PM Tuesday 8:30 AM - 4:00 PM Wednesday 8:30 AM - 4:00 PM Thursday 8:30 AM - 4:00 PM Friday 8:30 AM - 4:00 PM Saturday Closed Sunday Closed,Https://locations.northerntrust.com/us/fl/vero-beach/755-beachland-boulevard,United States,US,Indian River,27.653669,-80.359725,PREMISE: ROOFTOP
Northern Trust Miami,600 Brickell Avenue,Suite 2400,Miami,FL,33131,(305) 372-1000,Monday 8:30 AM - 4:00 PM Tuesday 8:30 AM - 4:00 PM Wednesday 8:30 AM - 4:00 PM Thursday 8:30 AM - 4:00 PM Friday 8:30 AM - 4:00 PM Saturday Closed Sunday Closed,,Https://locations.northerntrust.com/us/fl/miami/600-brickell-avenue,United States,US,Miami-Dade,25.767634,-80.190943,PREMISE: ROOFTOP
Northern Trust Coral Gables,595 Biltmore Way,,Coral Gables,FL,33134,(305) 529-7700,Monday 8:30 AM - 4:00 PM Tuesday 8:30 AM - 4:00 PM Wednesday 8:30 AM - 4:00 PM Thursday 8:30 AM - 4:00 PM Friday 8:30 AM - 4:00 PM Saturday Closed Sunday Closed,Monday 8:30 AM - 4:00 PM Tuesday 8:30 AM - 4:00 PM Wednesday 8:30 AM - 4:00 PM Thursday 8:30 AM - 4:00 PM Friday 8:30 AM - 4:00 PM Saturday Closed Sunday Closed,Https://locations.northerntrust.com/us/fl/coral-gables/595-biltmore-way,United States,US,Miami-Dade,25.748507,-80.266125,PREMISE: ROOFTOP
Northern Trust Key Biscayne,328 Crandon Boulevard,Suite 101,Key Biscayne,FL,33149,(305) 365-2000,Monday 8:30 AM - 4:00 PM Tuesday 8:30 AM - 4:00 PM Wednesday 8:30 AM - 4:00 PM Thursday 8:30 AM - 4:00 PM Friday 8:30 AM - 4:00 PM Saturday Closed Sunday Closed,,Https://locations.northerntrust.com/us/fl/key-biscayne/328-crandon-boulevard,United States,US,Miami-Dade,25.695555,-80.163781,PREMISE: ROOFTOP
Northern Trust Fort Lauderdale,1100 East Las Olas Boulevard,,Fort Lauderdale,FL,33301,(954) 768-4000,Monday 8:30 AM - 4:00 PM Tuesday 8:30 AM - 4:00 PM Wednesday 8:30 AM - 4:00 PM Thursday 8:30 AM - 4:00 PM Friday 8:30 AM - 4:00 PM Saturday Closed Sunday Closed,,Https://locations.northerntrust.com/us/fl/fort-lauderdale/1100-east-las-olas-boulevard,United States,US,Broward,26.118903,-80.131821,PREMISE: ROOFTOP
Northern Trust North Palm Beach,11301 Us Highway One,,North Palm Beach,FL,33408,(561) 622-4600,Monday 8:30 AM - 4:00 PM Tuesday 8:30 AM - 4:00 PM Wednesday 8:30 AM - 4:00 PM Thursday 8:30 AM - 4:00 PM Friday 8:30 AM - 4:00 PM Saturday Closed Sunday Closed,Monday 8:30 AM - 4:00 PM Tuesday 8:30 AM - 4:00 PM Wednesday 8:30 AM - 4:00 PM Thursday 8:30 AM - 4:00 PM Friday 8:30 AM - 4:00 PM Saturday Closed Sunday Closed,Https://locations.northerntrust.com/us/fl/north-palm-beach/11301-us-highway-one,United States,US,Palm Beach,26.84201,-80.062487,PREMISE: ROOFTOP
Northern Trust Boca Raton,3100 N Military Trail,,Boca Raton,FL,33431,(561) 998-9100,Monday 8:30 AM - 4:00 PM Tuesday 8:30 AM - 4:00 PM Wednesday 8:30 AM - 4:00 PM Thursday 8:30 AM - 4:00 PM Friday 8:30 AM - 4:00 PM Saturday Closed Sunday Closed,Monday 8:30 AM - 4:00 PM Tuesday 8:30 AM - 4:00 PM Wednesday 8:30 AM - 4:00 PM Thursday 8:30 AM - 4:00 PM Friday 8:30 AM - 4:00 PM Saturday Closed Sunday Closed,Https://locations.northerntrust.com/us/fl/boca-raton/3100-n-military-trail,United States,US,Palm Beach,26.380763,-80.120396,PREMISE: ROOFTOP
Northern Trust Palm Beach,440 Royal Palm Way,Suite 102,Palm Beach,FL,33480,(561) 802-2000,Monday 8:30 AM - 4:00 PM Tuesday 8:30 AM - 4:00 PM Wednesday 8:30 AM - 4:00 PM Thursday 8:30 AM - 4:00 PM Friday 8:30 AM - 4:00 PM Saturday Closed Sunday Closed,,Https://locations.northerntrust.com/us/fl/palm-beach/440-royal-palm-way,United States,US,Palm Beach,26.705354,-80.042467,PREMISE: ROOFTOP
Northern Trust Delray Beach,770 East Atlantic Avenue,,Delray Beach,FL,33483,(561) 278-1300,Monday 8:30 AM - 4:00 PM Tuesday 8:30 AM - 4:00 PM Wednesday 8:30 AM - 4:00 PM Thursday 8:30 AM - 4:00 PM Friday 8:30 AM - 4:00 PM Saturday Closed Sunday Closed,Monday 8:30 AM - 4:00 PM Tuesday 8:30 AM - 4:00 PM Wednesday 8:30 AM - 4:00 PM Thursday 8:30 AM - 4:00 PM Friday 8:30 AM - 4:00 PM Saturday Closed Sunday Closed,Https://locations.northerntrust.com/us/fl/delray-beach/770-east-atlantic-avenue,United States,US,Palm Beach,26.461464,-80.065551,PREMISE: ROOFTOP
