store_name,address,city,state,zip_code,lobby_hours,drive_thru_hours,phone_number,country,country_code,latitude,longitude,county,geo_accuracy
Greencastle | Carolle Street,308 Carolle Street,Greencastle,PA,17225,M-W 8:30 am - 4 pm|Th 8:30 am - 5 pm|Fri 8:30 am - 6 pm|Sat 9 am - Noon,M-Th 8:30 am - 5 pm|Fri 8:30 am - 6 pm|Sat 9 am - Noon,(888) 677-7869,United States,US,39.78598,-77.734292,Franklin County,PREMISE: ROOFTOP
Harrisburg | Lindle Road,4750 Lindle Road,Harrisburg,PA,17111,M-F 9 am - 5 pm,,(888) 677-7869,United States,US,40.24394,-76.800301,Dauphin County,PREMISE: ROOFTOP
Lancaster | Fruitville Pike,1800 Fruitville Pike,Lancaster,PA,17601,,,(888) 677-7869,United States,US,40.071832,-76.319287,Lancaster County,PREMISE: ROOFTOP
Lancaster | Olde Hickory Road,500 Olde Hickory Road,Lancaster,PA,17601,M-W 8:30 am - 4 pm|Th 8:30 am - 5 pm|Fri 8:30 am - 6 pm|Sat 9 am - Noon,M-Th 8:30 am - 5 pm|Fri 8:30 am - 6 pm|Sat 9 am - Noon,(888) 677-7869,United States,US,40.087359,-76.284573,Lancaster County,PREMISE: ROOFTOP
Lancaster | Lausch Lane,566 Lausch Lane,Lancaster,PA,17601,M-W 8:30 am - 4 pm|Th 8:30 am - 5 pm|Fri 8:30 am - 6 pm|Sat 9 am - Noon,M-Th 8:30 am - 5 pm|Fri 8:30 am - 6 pm|Sat 9 am - Noon,(888) 677-7869,United States,US,40.081691,-76.339188,Lancaster County,PREMISE: ROOFTOP
Lititz | Lititz Pike,920 Lititz Pike,Lititz,PA,17543,M-W 8:30 am - 4 pm|Th 8:30 am - 5 pm|Fri 8:30 am - 6 pm|Sat closed,M-Th 8:30 am - 5 pm|Fri 8:30 am - 6 pm|Sat closed,(888) 677-7869,United States,US,40.135796,-76.30392,Lancaster County,PREMISE: ROOFTOP
Mechanicsburg | Baden Powell Lane,3 Baden Powell Lane,Mechanicsburg,PA,17050,M-W 8:30 am - 4 pm|Th 8:30 am - 5 pm|Fri 8:30 am - 6 pm|Sat 9 am - Noon,M-Th 8:30 am - 5 pm|Fri 8:30 am - 6 pm|Sat 9 am - Noon,(888) 677-7869,United States,US,40.251562,-77.029458,Cumberland County,PREMISE: ROOFTOP
Mercersburg | South Main Street,12 South Main Street,Mercersburg,PA,17236,M-W 8:30 am - 4 pm|Th 8:30 am - 5 pm|Fri 8:30 am - 6 pm|Sat 9 am - Noon,M-Th 8:30 am - 5 pm|Fri 8:30 am - 6 pm|Sat 9 am - Noon,(888) 677-7869,United States,US,39.827934,-77.903934,Franklin County,PREMISE: ROOFTOP
Mount Joy | West Main Street,1009 West Main Street,Mount Joy,PA,17552,,,(888) 677-7869,United States,US,40.116412,-76.528542,Lancaster County,PREMISE: ROOFTOP
New Holland | West Main Street,301 West Main Street,New Holland,PA,17557,M-W 8:30 am - 4 pm|Th 8:30 am - 5 pm|Fri 8:30 am - 6 pm|Sat 9 am - Noon,M-Th 8:30 am - 5 pm|Fri 8:30 am - 6 pm|Sat 9 am - Noon,(888) 677-7869,United States,US,40.101114,-76.096464,Lancaster County,PREMISE: ROOFTOP
