store_name,address,address_line_2,city,state,zip_code,phone_number,fax_number,email_address,store_hours,latitude,longitude,country,country_code,county,geo_accuracy
,1985 Riviera Dr,Ste 103,Mount Pleasant,SC,29464,(843) 849-0515,(843) 849-0517,,"9:00 AM - 5:00 PM 9:00 AM - 5:00 PM 9:00 AM - 5:00 PM 9:00 AM - 5:00 PM 9:00 AM - 5:00 PM 10:00 AM - 2:00 PMClosed Today 1985 Riviera Dr Ste 103 Mount Pleasant, SC 29464 US(843) 849-0515(843) 849-0515(843) 849-0517(843) 849-0517sc114@postnet.com Day of the WeekHours Mon9:00 AM - 5:00 PM Tue9:00 AM - 5:00 PM Wed9:00 AM - 5:00 PM Thu9:00 AM - 5:00 PM Fri9:00 AM - 5:00 PM Sat10:00 AM - 2:00 PM SunClosed",32.820784789193596,-79.81522462517434,United States,US,Charleston County,AGGDATA_VERIFIED: ROOFTOP
,1646 W Hwy 160,,Fort Mill,SC,29708,(803) 548-2831,(803) 548-3854,,"9:00 AM - 6:00 PM 9:00 AM - 6:00 PM 9:00 AM - 6:00 PM 9:00 AM - 6:00 PM 9:00 AM - 6:00 PM 10:00 AM - 2:00 PMClosed Today 1646 W Hwy 160 Fort Mill, SC 29708 US(803) 548-2831(803) 548-2831(803) 548-3854(803) 548-3854sc110@postnet.com Day of the WeekHours Mon9:00 AM - 6:00 PM Tue9:00 AM - 6:00 PM Wed9:00 AM - 6:00 PM Thu9:00 AM - 6:00 PM Fri9:00 AM - 6:00 PM Sat10:00 AM - 2:00 PM SunClosed",35.03118327,-80.96740779,United States,US,York County,AGGDATA_VERIFIED: ROOFTOP
,2274 Salem Rd SE,#106,Conyers,GA,30013,(770) 761-8499,,,"9:00 AM - 6:00 PM 9:00 AM - 6:00 PM 9:00 AM - 6:00 PM 9:00 AM - 6:00 PM 9:00 AM - 6:00 PM 10:00 AM - 3:00 PMClosed Today 2274 Salem Rd SE #106 Conyers, GA 30013 US(770) 761-8499(770) 761-8499ga106@postnet.com Day of the WeekHours Mon9:00 AM - 6:00 PM Tue9:00 AM - 6:00 PM Wed9:00 AM - 6:00 PM Thu9:00 AM - 6:00 PM Fri9:00 AM - 6:00 PM Sat10:00 AM - 3:00 PM SunClosed",33.62902150858791,-83.97668800503426,United States,US,Rockdale County,AGGDATA_VERIFIED: ROOFTOP
,11585 Jones Bridge Road,Ste 420,Johns Creek,GA,30022,(678) 580-5019,(678) 615-3967,,"8:30 AM - 6:00 PM 8:30 AM - 6:00 PM 8:30 AM - 6:00 PM 8:30 AM - 6:00 PM 8:30 AM - 6:00 PM 9:00 AM - 3:00 PMClosed Today 11585 Jones Bridge Road Ste 420 Johns Creek, GA 30022-7476 US(678) 580-5019(678) 580-5019(678) 615-3967(678) 615-3967ga133@postnet.com Day of the WeekHours Mon8:30 AM - 6:00 PM Tue8:30 AM - 6:00 PM Wed8:30 AM - 6:00 PM Thu8:30 AM - 6:00 PM Fri8:30 AM - 6:00 PM Sat9:00 AM - 3:00 PM SunClosed",34.061891,-84.214544,United States,US,Fulton County,PREMISE: ROOFTOP
Atlanta,1700 Northside Drive Ste A7,,Atlanta,GA,30318,(678) 612-9709,,,Mon9:00 AM - 5:00 PM Tue9:00 AM - 5:00 PM Wed9:00 AM - 5:00 PM Thu9:00 AM - 5:00 PM Fri9:00 AM - 5:00 PM SatClosed SunClosed,33.800836,-84.408362,United States,US,Fulton County,PREMISE: ROOFTOP
Atlanta,285 West Wieuca Road NE,,Atlanta,GA,30342,(404) 748-9065,,,Mon9:00 AM - 5:00 PM Tue9:00 AM - 5:00 PM Wed9:00 AM - 5:00 PM Thu9:00 AM - 5:00 PM Fri9:00 AM - 5:00 PM SatClosed SunClosed,33.875372,-84.377999,United States,US,Fulton County,PREMISE: ROOFTOP
,5900 Spout Springs Road,Unit 3C,Flowery Branch,GA,30542,(678) 828-9902,,,"8:30 AM - 6:00 PM 8:30 AM - 6:00 PM 8:30 AM - 6:00 PM 8:30 AM - 6:00 PM 8:30 AM - 6:00 PM 9:00 AM - 2:00 PMClosed Today 5900 Spout Springs Road Unit 3C Flowery Branch, GA 30542 US(678) 828-9902(678) 828-9902ga132@postnet.com Day of the WeekHours Mon8:30 AM - 6:00 PM Tue8:30 AM - 6:00 PM Wed8:30 AM - 6:00 PM Thu8:30 AM - 6:00 PM Fri8:30 AM - 6:00 PM Sat9:00 AM - 2:00 PM SunClosed",34.176314,-83.91204,United States,US,Hall County,PREMISE: ROOFTOP
,6350 Lake Oconee Pkwy,#110,Greensboro,GA,30642,(706) 453-4901,,,"8:30 AM - 6:00 PM 8:30 AM - 6:00 PM 8:30 AM - 6:00 PM 8:30 AM - 6:00 PM 8:30 AM - 6:00 PM 9:00 AM - 2:00 PMClosed Today 6350 Lake Oconee Pkwy #110 Greensboro, GA 30642 US(706) 453-4901(706) 453-4901ga123@postnet.com Day of the WeekHours Mon8:30 AM - 6:00 PM Tue8:30 AM - 6:00 PM Wed8:30 AM - 6:00 PM Thu8:30 AM - 6:00 PM Fri8:30 AM - 6:00 PM Sat9:00 AM - 2:00 PM SunClosed",33.455753,-83.244656,United States,US,Greene County,PREMISE: ROOFTOP
,512 S Peterson Ave,,Douglas,GA,31533,(912) 384-9567,(912) 383-6675,,"9:00 AM - 5:30 PM 9:00 AM - 5:30 PM 9:00 AM - 5:30 PM 9:00 AM - 5:30 PM 9:00 AM - 5:30 PMClosed Today Closed Today 512 S Peterson Ave Douglas, GA 31533 US(912) 384-9567(912) 384-9567(912) 383-6675(912) 383-6675ga102@postnet.com Day of the WeekHours Mon9:00 AM - 5:30 PM Tue9:00 AM - 5:30 PM Wed9:00 AM - 5:30 PM Thu9:00 AM - 5:30 PM Fri9:00 AM - 5:30 PM SatClosed SunClosed",31.50283890286416,-82.84991757944228,United States,US,Coffee County,AGGDATA_VERIFIED: ROOFTOP
,7940 Front Beach Rd,,Panama City Beach,FL,32407,(850) 235-3777,(850) 235-1020,,"9:00 AM - 5:30 PM 9:00 AM - 5:30 PM 9:00 AM - 5:30 PM 9:00 AM - 5:30 PM 9:00 AM - 5:30 PMClosed Today Closed Today 7940 Front Beach Rd Panama City Beach, FL 32407 US(850) 235-3777(850) 235-3777(850) 235-1020(850) 235-1020fl102@postnet.com Day of the WeekHours Mon9:00 AM - 5:30 PM Tue9:00 AM - 5:30 PM Wed9:00 AM - 5:30 PM Thu9:00 AM - 5:30 PM Fri9:00 AM - 5:30 PM SatClosed SunClosed",30.18753115,-85.77356,United States,US,Bay County,AGGDATA_VERIFIED: ROOFTOP
