distributor_name,address,city,state,zip_code,phone_number,email_address,website_address,country,country_code,county,latitude,longitude,geo_accuracy
The Pool Doctor / Clearwater,13831 Us 19,Clearwater,FL,33764,(727) 530-9787,,,United States,US,Pinellas County,27.897697,-82.723672,PREMISE: ROOFTOP
Poulin Cooling,1867 Brentwood Dr,Clearwater,FL,33764,(727) 252-9602,marcus@poulincooling.com,,United States,US,Pinellas County,27.9502,-82.759144,PREMISE: ROOFTOP
Lewis A/C & Heating,102 South Nimbus Avenue,Clearwater,FL,33765,(727) 447-2787,lewisair@tampabay.rr.com,,United States,US,Pinellas County,27.963959,-82.753035,PREMISE: ROOFTOP
"Best Services, Inc / Clearwater",1630 N Hercules Ave Suite D,Clearwater,FL,33765,(727) 773-0151,service@thebestac.com,,United States,US,Pinellas County,27.98137,-82.756664,PREMISE: ROOFTOP
Alina Group Llc,7360 Ulmerton Rd,Largo,FL,33771,(727) 600-6922,alinagroupllc@gmail.com,,United States,US,Pinellas County,27.892436,-82.741595,PREMISE: ROOFTOP
Curley's Air Conditioning,10396 66Th Ave,Seminole,FL,33772,(727) 391-1789,coolairofpinellas@yahoo.com,,United States,US,Pinellas County,27.831927,-82.78269,PREMISE: ROOFTOP
"Air 15, Inc",11395 66Th St N,Largo,FL,33773,(727) 441-1515,air15@tampabay.rr.com,,United States,US,Pinellas County,27.875268,-82.727841,PREMISE: ROOFTOP
Frontline Services Achr,7315 118Th Ter.,Largo,FL,33773,(727) 251-8065,kengyang1980@gmail.com,,United States,US,Pinellas County,27.878415,-82.740452,PREMISE: ROOFTOP
At Last A/C & Heating Service,8067 Cottonwoode Drive,Largo,FL,33773,(727) 409-3048,al.atlastac@gmail.com,,United States,US,Pinellas County,27.886884,-82.750487,PREMISE: ROOFTOP
Revolution A/C + Htg,8063 Quinn Ct,Seminole,FL,33777,(727) 639-3275,revolutionair@yahoo.com,,United States,US,Pinellas County,27.850626,-82.749749,PREMISE: ROOFTOP
