store_name,address,address_line_2,address_line_3,city,state,zip_code,country,phone_number,email_address,store_hours,website_address,country_code,latitude,longitude,geo_accuracy,county
King Of Prussia,King Of Prussia Mall,160 N Gulph Road,,King Of Prussia,PA,19406,United States,1(215) 278-8038,Kingofprussia@suitsupply.com,Opening Hours Today 10:00 Am - 8:00 Pm Wednesday 10:00 Am - 8:00 Pm Thursday 10:00 Am - 8:00 Pm Friday 10:00 Am - 9:00 Pm Saturday 10:00 Am - 9:00 Pm Sunday 11:00 Am - 6:00 Pm Monday 10:00 Am - 8:00 Pm,https://suitsupply.com/en-us/stores/KingofPrussia,US,40.087599,-75.394646,PREMISE: ROOFTOP,Montgomery County
La Abbot Kinney,1136 Abbot Kinney Blvd,,,Venice,CA,90291,United States,1(424) 206-6180,Laabbotkinney@suitsupply.com,Opening Hours Today 11:00 Am - 6:00 Pm Wednesday 11:00 Am - 6:00 Pm Thursday 11:00 Am - 6:00 Pm Friday 11:00 Am - 7:00 Pm Saturday 11:00 Am - 7:00 Pm Sunday 11:00 Am - 6:00 Pm Monday 11:00 Am - 6:00 Pm,https://suitsupply.com/en-us/stores/AbbotKinney,US,33.9913086,-118.4695391,AGGDATA_VERIFIED: ROOFTOP,Los Angeles County
La Century City,10250 Santa Monica Boulevard,Space 1825,,Los Angeles,CA,90067,United States,1(424) 201-0885,Lacenturycity@suitsupply.com,Opening Hours Today 10:00 Am - 9:00 Pm Wednesday 10:00 Am - 9:00 Pm Thursday 10:00 Am - 9:00 Pm Friday 10:00 Am - 9:00 Pm Saturday 10:00 Am - 9:00 Pm Sunday 11:00 Am - 8:00 Pm Monday 10:00 Am - 9:00 Pm,https://suitsupply.com/en-us/stores/LACenturyCity,US,34.059485,-118.420449,PREMISE: ROOFTOP,Los Angeles County
Las Vegas,3327 Las Vegas Blvd. South,Suite 2744,,Las Vegas,NV,89109,United States,1(702) 766-7497,Lasvegas@suitsupply.com,Opening Hours Today 10:00 Am - 9:00 Pm Wednesday 10:00 Am - 9:00 Pm Thursday 10:00 Am - 9:00 Pm Friday 10:00 Am - 9:00 Pm Saturday 10:00 Am - 9:00 Pm Sunday 10:00 Am - 8:00 Pm Monday 10:00 Am - 9:00 Pm,https://suitsupply.com/en-us/stores/LasVegas,US,36.124268,-115.168148,PREMISE: ROOFTOP,Clark County
Miami Beach,1000 17th Street,,,Miami,FL,33139,United States,1(305) 570-3185,Miami@suitsupply.com,Opening Hours Today 12:00 Pm - 6:00 Pm Wednesday 12:00 Pm - 6:00 Pm Thursday 12:00 Pm - 6:00 Pm Friday 12:00 Pm - 6:00 Pm Saturday 12:00 Pm - 6:00 Pm Sunday 12:00 Pm - 6:00 Pm Monday 12:00 Pm - 6:00 Pm,https://suitsupply.com/en-us/stores/Miami,US,25.791921,-80.139179,PREMISE: ROOFTOP,Miami-Dade County
Miami Brickell,Brickell City Center,"701 S Miami Ave, Suite-161",,Miami,FL,33131,United States,1(305) 363-7707,Miamibrickell@suitsupply.com,Opening Hours Today 11:00 Am - 8:00 Pm Wednesday 11:00 Am - 8:00 Pm Thursday 11:00 Am - 8:00 Pm Friday 11:00 Am - 8:00 Pm Saturday 11:00 Am - 9:00 Pm Sunday 11:00 Am - 7:00 Pm Monday 11:00 Am - 8:00 Pm,https://suitsupply.com/en-us/stores/MiamiBrickell,US,25.766891,-80.192423,PREMISE: ROOFTOP,Miami-Dade County
Nj Short Hills,1200 Morris Turnpike,Suite #a125,,Short Hills,NJ,07078,United States,1(862) 372-6996,Shorthills@suitsupply.com,Opening Hours Today 10:00 Am - 8:00 Pm Wednesday 10:00 Am - 8:00 Pm Thursday 10:00 Am - 8:00 Pm Friday 10:00 Am - 8:00 Pm Saturday 10:00 Am - 8:00 Pm Sunday 11:00 Am - 6:00 Pm Monday 10:00 Am - 8:00 Pm,https://suitsupply.com/en-us/stores/ShortHills,US,40.739596,-74.36529,PREMISE: ROOFTOP,Essex County
Ny Brookfield Place,230 Vesey Street,Suite 210,,New York,NY,10281,United States,1(843) 631-6674,Brookfield@suitsupply.com,Opening Hours Today 11:00 Am - 8:00 Pm Wednesday 11:00 Am - 8:00 Pm Thursday 11:00 Am - 8:00 Pm Friday 11:00 Am - 8:00 Pm Saturday 11:00 Am - 8:00 Pm Sunday 12:00 Pm - 6:00 Pm Monday 11:00 Am - 8:00 Pm,https://suitsupply.com/en-us/stores/Brookfield,US,40.714055,-74.015306,PREMISE: ROOFTOP,New York County
Ny Hudson Yards,211 Hudson Yards,,,New York,NY,10001,United States,1(646) 825-5030,Hudsonyards@suitsupply.com,Opening Hours Today 10:00 Am - 8:00 Pm Wednesday 10:00 Am - 8:00 Pm Thursday 10:00 Am - 8:00 Pm Friday 10:00 Am - 8:00 Pm Saturday 10:00 Am - 8:00 Pm Sunday 11:00 Am - 7:00 Pm Monday 10:00 Am - 8:00 Pm,https://suitsupply.com/en-us/stores/NewYork-Hudson,US,40.7534645,-74.0016887,SUBPREMISE: ROOFTOP,New York County
Ny Madison Avenue,635 Madison Avenue,,,New York,NY,10022,United States,1(917) 336-5490,Nymadison@suitsupply.com,Opening Hours Today 11:00 Am - 7:00 Pm Wednesday 11:00 Am - 7:00 Pm Thursday 11:00 Am - 7:00 Pm Friday 11:00 Am - 7:00 Pm Saturday 11:00 Am - 7:00 Pm Sunday 12:00 Pm - 6:00 Pm Monday 11:00 Am - 7:00 Pm,https://suitsupply.com/en-us/stores/NewYork-Madison,US,40.76367763871144,-73.97118097667244,AGGDATA_VERIFIED: ROOFTOP,New York County
