store_name,address,address_line_2,city,state,zip_code,phone_number,fax_number,branch_hours,teller_hours,drive_thru_hours,services,atm,branch,latitude,longitude,slug,country,country_code,county,geo_accuracy
Lee Highway,7001 Lee Hwy,,Chattanooga,TN,37421,(423) 242-0631,423-899-6077,Monday 9AM to 5PM Tuesday 9AM to 5PM Wednesday 9AM to 5PM Thursday 9AM to 5PM Friday 9AM to 6PM Saturday Closed Sunday Closed,,,"Branch, Atm, Commercial Center, Mortgage Office, Investment Center, Small Business Solutions",ATM,BRANCH,35.04535456,-85.16253445,/branch/tn/chattanooga/37421/lee-highway,United States,US,Hamilton,AGGDATA_VERIFIED: ROOFTOP
Market Street,1806 West Market Street,,Johnson City,TN,37604,(423) 491-4010,423-434-0794,Monday 9AM to 5PM Tuesday 9AM to 5PM Wednesday 9AM to 5PM Thursday 9AM to 5PM Friday 9AM to 6PM Saturday 9AM to 1PM Sunday,,Monday 9AM to 5PM Tuesday 9AM to 5PM Wednesday 9AM to 5PM Thursday 9AM to 5PM Friday 9AM to 6PM Saturday 9AM to 1PM Sunday,"Branch, Atm, Drive-thru Banking, Mortgage Office, Investment Center, Weekend Hours, Small Business Solutions",ATM,BRANCH,36.31226779,-82.3865068,/branch/tn/johnson-city/37604/market-street,United States,US,Washington,AGGDATA_VERIFIED: ROOFTOP
Johnson City Main Office,207 Mockingbird Lane,,Johnson City,TN,37604,(423) 461-1090,423-461-1125,Monday 9AM to 5PM Tuesday 9AM to 5PM Wednesday 9AM to 5PM Thursday 9AM to 5PM Friday 9AM to 6PM Saturday 9AM to 1PM Sunday,,Monday 9AM to 5PM Tuesday 9AM to 5PM Wednesday 9AM to 5PM Thursday 9AM to 5PM Friday 9AM to 6PM Saturday 9AM to 1PM Sunday,"Branch, Atm, Drive-thru Banking, Mortgage Office, Investment Center, Weekend Hours, Small Business Solutions",ATM,BRANCH,36.33548172,-82.37498838,/branch/tn/johnson-city/37604/johnson-city-main-office,United States,US,Washington,AGGDATA_VERIFIED: ROOFTOP
Citi Cards,104 Suncrest Dr,,Gray,TN,37615,,,AlwaysClosed,AlwaysClosed,AlwaysClosed,Atm,ATM,,36.41598309,-82.47585889,/atm/tn/gray/37615/atm-citi-cards,United States,US,Washington,AGGDATA_VERIFIED: ROOFTOP
Kingsport Financial Center,1776 Fort Henry Drive,,Kingsport,TN,37664,(423) 245-5509,423-247-2112,Monday 9AM to 5PM Tuesday 9AM to 5PM Wednesday 9AM to 5PM Thursday 9AM to 5PM Friday 9AM to 6PM Saturday 9AM to 1PM Sunday,,Monday 9AM to 5PM Tuesday 9AM to 5PM Wednesday 9AM to 5PM Thursday 9AM to 5PM Friday 9AM to 6PM Saturday 9AM to 1PM Sunday,"Branch, Drive-thru Banking, Mortgage Office, Investment Center, Weekend Hours, Small Business Solutions",,BRANCH,36.5313537,-82.5259611,/branch/tn/kingsport/37664/kingsport-financial-center,United States,US,Sullivan,PREMISE: ROOFTOP
Hunters Crossing,1075 Hunters Xing,,Alcoa,TN,37701,(865) 681-5680,865-983-3401,Monday 9AM to 5PM Tuesday 9AM to 5PM Wednesday 9AM to 5PM Thursday 9AM to 5PM Friday 9AM to 6PM Saturday Closed Sunday Closed,,Monday 9AM to 5PM Tuesday 9AM to 5PM Wednesday 9AM to 5PM Thursday 9AM to 5PM Friday 9AM to 6PM Saturday Closed Sunday Closed,"Branch, Drive-thru Banking, Commercial Center, Mortgage Office, Investment Center, Small Business Solutions",,BRANCH,35.769599,-83.988717,/branch/tn/alcoa/37701/hunters-crossing,United States,US,Blount,PREMISE: ROOFTOP
Mcghee Tyson Airport,2055 Airport Hwy,,Alcoa,TN,37701,,,AlwaysClosed,AlwaysClosed,AlwaysClosed,Atm,ATM,,35.81083043,-83.99389246,/atm/tn/alcoa/37701/atm-mcghee-tyson-airport,United States,US,Blount,AGGDATA_VERIFIED: ROOFTOP
Clinton,1110 North Charles G. Seivers Boulevard,,Clinton,TN,37716,(865) 269-7501,865-457-7787,Monday 9AM to 5PM Tuesday 9AM to 5PM Wednesday 9AM to 5PM Thursday 9AM to 5PM Friday 9AM to 5PM Saturday Closed Sunday Closed,,Monday 9AM to 5PM Tuesday 9AM to 5PM Wednesday 9AM to 5PM Thursday 9AM to 5PM Friday 9AM to 5PM Saturday Closed Sunday Closed,"Branch, Drive-thru Banking, Commercial Center, Mortgage Office, Investment Center",,BRANCH,36.11783945,-84.11853891,/branch/tn/clinton/37716/clinton,United States,US,Anderson,AGGDATA_VERIFIED: ROOFTOP
Food City Gas N Go,509 South Charles Sevier,,Clinton,TN,37716,,,AlwaysClosed,AlwaysClosed,AlwaysClosed,Atm,ATM,,36.09085391,-84.1406036,/atm/tn/clinton/37716/atm-food-city-gas-n-go,United States,US,Anderson,AGGDATA_VERIFIED: ROOFTOP
Lake City,506 South Main Street,,Lake City,TN,37769,(865) 630-6001,865-426-6965,Monday 9AM to 5PM Tuesday 9AM to 5PM Wednesday 9AM to 5PM Thursday 9AM to 5PM Friday 9AM to 6PM Saturday Closed Sunday Closed,,Monday 9AM to 5PM Tuesday 9AM to 5PM Wednesday 9AM to 5PM Thursday 9AM to 5PM Friday 9AM to 6PM Saturday Closed Sunday Closed,"Branch, Atm, Drive-thru Banking, Commercial Center, Mortgage Office, Investment Center, Small Business Solutions",ATM,BRANCH,36.21777395,-84.15423894,/branch/tn/lake-city/37769/lake-city,United States,US,Anderson,AGGDATA_VERIFIED: ROOFTOP
