store_name,address,city,zip_code,phone_number,store_services,store_hours,state,latitude,longitude,country,county,country_code,geo_accuracy
Supermarche G20 Ccbl,25 Ter Rue De La Chaussee,Argentan,61200,02 33 12 11 45 - Fax : 0233121146,Livraison - domicile (voir conditions en magasin). Dépôt de pain. Fax,"Du lundi au samedi de 7h - 21h, le dimanche - - partir de 9h",Normandie,48.7434872,-0.0223438,France,Orne,FR,SUBPREMISE: ROOFTOP
Supermarche G20 Distri Marche,39/41 Place Louis Xiii,Rungis,94150,01 46 75 09 92 - Fax : 0146750992,Dépôt de pain. Photocopieur. Livraison - - domicile gratuite dès 50-'- d'achats (voir conditions en magasin). Parking,"Du lundi au vendredi de 8h - - 13h30 et de 15h30 - - 20h30, le samedi de 8h - - 20h30, le dimanche de 9h - 13h",IDF,48.7508012,2.345288,France,Val-de-Marne,FR,SUBPREMISE: ROOFTOP
Supermarche G20 Supermarche G20 Kla,15 Place Arthur Rimbaud,Brevannes,94450 LIMEIL,143824633,Point chaud - Fleurs - Photomaton - Relais colis - Photocopieur - Parking - Tickets Restaurant,"Du lundi au samedi de 8h30 - 20h, le dimanche de 9h - 10h30",IDF,48.7524178,2.473524,France,Val-de-Marne,FR,STREET_ADDRESS: ROOFTOP
Supermarche G20 Supermarche G20 Smart,15 Avenue Anatole France,Roi,94600 CHOISY LE,,Tickets Restaurant - Livraison - domicile (voir conditions en magasin),"Du lundi au samedi de 7h - 23h, le dimanche dès 7h",IDF,48.7640427,2.4105717,France,Val-de-Marne,FR,PREMISE: ROOFTOP
Supermarche G20 Supermarche G20 Jobi G20,1 Allée Costes & Bellonte,Rue,94550 CHEVILLY LA,142240698,,,IDF,48.7680546,2.3511949,France,Val-de-Marne,FR,POSTAL_CODE: APPROXIMATE
Supermarche G20 Crette Distri,25-31 Rue Henri Crette,Chevilly-Larue,94550,145129860,Livraison - domicile (voir conditions en magasin) - Fruits & Légumes - Tickets Restaurant,"Du lundi au samedi de 8h30 - 21h, le dimanche dès 8h30",IDF,48.7731418,2.3532794,France,Val-de-Marne,FR,STREET_ADDRESS: ROOFTOP
Supermarche G20 Duhesme Distribution,1 Place De La Fraternite,Sucy-En-Brie,94370,01 45 90 84 64,Fleurs. Photomaton. Photocopieur. Tickets restaurants. Livraison - domicile (voir conditions en magasin),"Du lundi au samedi de 9h - 20h30, le dimanche de 9h - 13h",IDF,48.7745947,2.5259788,France,Val-de-Marne,FR,STREET_ADDRESS: RANGE_INTERPOLATED
Supermarche G20 Clamart Distribution,103 Rue De La Bourcilliere,Clamart,92140,,Livraison - - domicile (voir conditions en magasin). Point chaud</div><div class=g20-minute><div class=g20-minute-title>Mes courses en ligne</div><a href=https://www.g20-minute.com/ target=_blank><img src=/bundles/g20frontend/images/store/g20-minute-horizontal.pngv1.0.3 alt=Accéder - G20 Minute /></a>,"Du lundi au samedi de 8h30 - - 19h30, le dimanche - - partir de 8h30",IDF,48.7800499,2.2285497,France,Hauts-de-Seine,FR,PREMISE: ROOFTOP
Supermarche G20 Supermarche G20 Illico,28 Rue Marc Sangnier,Cachan,94230,,Dépôt de pain - Livraison - domicile (voir conditions en magasin) - Tickets Restaurant,"DU lundi au samedi de 7h - 21h, le dimanche dès 7h",IDF,48.7862302,2.3323685,France,Val-de-Marne,FR,STREET_ADDRESS: ROOFTOP
Supermarche G20 Supermarche G20 Zina Distribution,30 Avenue Du Marechal Lyautey,Creteil,94000,148984830,Point chaud - Livraison - domicile (voir conditions en magasin),"Du lundi au samedi de 8h30 - 20h30, le dimanche dès 9h",IDF,48.7890046,2.4532607,France,Val-de-Marne,FR,STREET_ADDRESS: ROOFTOP
