store_number,distributor_name,address,city,state,zip_code,store_hours,phone_number,products,all_services,additional_info,website_address,latitude,longitude,country,county,country_code,geo_accuracy
58990,CARROLL DSTRBTNG & CONSTR SUPPL INC,13655 Main St,Lemont,IL,60439,,(641) 455-5545,Generator Sales,Generator Sales,,https://www.yamahamotorsports.com/motorsports/locations/dealersearch,41.688616417056544,-87.95318875461476,United States,Cook County,US,AGGDATA_VERIFIED: ROOFTOP
210410,LARSEN MARINE,625 E Sea Horse Dr,Waukegan,IL,60085,MONDAY 08:00 AM TO 05:00 PM|TUESDAY 08:00 AM TO 05:00 PM|WEDNESDAY 08:00 AM TO 05:00 PM|THURSDAY 08:00 AM TO 05:00 PM|FRIDAY 08:00 AM TO 05:00 PM|SATURDAY 09:00 AM TO 04:00 PM,(847) 336-5456,Outboard Boat Packages,Outboard Boat Packages,,https://www.yamahamotorsports.com/motorsports/locations/dealersearch,42.36795,-87.821332,United States,Lake County,US,PREMISE: ROOFTOP
204040,THE BOAT HOUSE OF CHICAGO,515 Bald Knob Rd,Johnsburg,IL,60051,,(815) 788-1111,Outboard Boat Packages,Outboard Boat Packages,{Certifications: Yamalubeu00ae Exclusive Service Center - Outboard},https://www.yamahamotorsports.com/motorsports/locations/dealersearch,42.3852987,-88.2073082,United States,McHenry County,US,PREMISE: APPROXIMATE
279850,RICHS YAMAHA,14354 S Archer Ave,Lockport,IL,60441,SUNDAY 10:00 AM TO 03:00 PM|MONDAY 09:00 AM TO 07:00 PM|TUESDAY 09:00 AM TO 07:00 PM|WEDNESDAY 09:00 AM TO 06:00 PM|THURSDAY 09:00 AM TO 07:00 PM|FRIDAY 09:00 AM TO 07:00 PM|SATURDAY 09:00 AM TO 04:00 PM,(815) 838-8130,ATVs & Demos|Generator Sales & Service|Motorcyles & Demos|Scooters|Side by Sides & Demos|Snowmobiles|WaveRunners,ATVs & Demos|Generator Sales & Service|Motorcyles & Demos|Scooters|Side by Sides & Demos|Snowmobiles|WaveRunners,{Certifications: Yamaha Parts Academy - Motorsports|YTA Gold Motorsports Technician|Home Delivery Available|YTA Snowmobile Technician|WaveRunner High Customer Satisfaction Dealer},https://www.yamahamotorsports.com/motorsports/locations/dealersearch,41.625773710339445,-88.02399467676423,United States,Will County,US,AGGDATA_VERIFIED: ROOFTOP
58990,CARROLL DSTRBTNG & CONSTR SUPPL INC,460 Briscoe Dr,Morris,IL,60450,,(641) 455-5545,Generator Sales,Generator Sales,,https://www.yamahamotorsports.com/motorsports/locations/dealersearch,41.391873197628115,-88.4146706573722,United States,Grundy County,US,AGGDATA_VERIFIED: ROOFTOP
570174,GRAND SPORT CENTER,630 E Us Route 6 Bldg 1,Morris,IL,60450,,(815) 941-2220,,,,https://www.yamahamotorsports.com/motorsports/locations/dealersearch,41.392394,-88.410245,United States,Grundy County,US,AGGDATA_VERIFIED: ROOFTOP
120060,"ENGINEMASTERS, INC.",22037 Howell Dr,New Lenox,IL,60451,,(630) 860-0610,,,,https://www.yamahamotorsports.com/motorsports/locations/dealersearch,41.48833156593821,-87.92888704687357,United States,Will County,US,AGGDATA_VERIFIED: ROOFTOP
346970,"WATERWERKS BOAT SALES, INC.",18660 S Cicero Ave,Country Club Hills,IL,60478,MONDAY 09:00 AM TO 05:00 PM|TUESDAY 09:00 AM TO 05:00 PM|WEDNESDAY 09:00 AM TO 05:00 PM|THURSDAY 09:00 AM TO 05:00 PM|FRIDAY 09:00 AM TO 05:00 PM|SATURDAY 09:00 AM TO 02:00 PM,(708) 798-9700,Outboard Boat Packages,Outboard Boat Packages,,https://www.yamahamotorsports.com/motorsports/locations/dealersearch,41.549400594740426,-87.7334596402898,United States,Cook County,US,AGGDATA_VERIFIED: ROOFTOP
33560,BEDFORD SALES AND OUTDOORS,879 Bedford Rd,Morris,IL,60450,,(815) 942-1333,Outboard Boat Packages,Outboard Boat Packages,,https://www.yamahamotorsports.com/motorsports/locations/dealersearch,41.37095512931454,-88.43597767874829,United States,Grundy County,US,AGGDATA_VERIFIED: ROOFTOP
83330,"HARBORSIDE MARINA, INC.",27425 S Will Rd,Wilmington,IL,60481,,(815) 476-4400,Outboard Boat Packages,Outboard Boat Packages,,https://www.yamahamotorsports.com/motorsports/locations/dealersearch,41.384089,-88.249377,United States,Will County,US,AGGDATA_VERIFIED: ROOFTOP
