store_name,address,city,state,zip_code,phone_number,fax_number,lobby_hours,drive_thru_hours,latitude,longitude,country,county,country_code,geo_accuracy
Dunlap Industrial,92 Resource Rd,Dunlap,TN,37327,(423) 949-4680,,,M-TH 7:00-4:00 Fri 7:00-5:00 Sat 8:00-1:00,35.401923,-85.37153,United States,Sequatchie County,US,PREMISE: ROOFTOP
Dunlap South,7312 SR 28,Dunlap,TN,37327,(423) 949-5051,,M-Th 7:00-4:00 Fri 7:00-5:00 Sat 8:00-1:00,M-TH 7:00-4:00 Fri 7:00-5:00 Sat 8:00-1:00,35.3584177,-85.39718429999999,United States,Sequatchie County,US,PREMISE: ROOFTOP
Jasper,4765 Main St,Jasper,TN,37347,(423) 942-1990,(423) 942-1980,M-Th 8:30-4:00 Fri 8:30-5:00,M-Th 8:00-04:00 Fri 8:00-05:00 Sat 8:00-12:00,35.074607,-85.619158,United States,Marion County,US,PREMISE: ROOFTOP
Monteagle Office,80 East Main Street,Monteagle,TN,37356,(931) 924-4242,(931) 924-2022,M-Th 8:30-4:00 Fri 8:30-5:00,M-Th 8:30-04:00 Fri 8:30-05:00 Sat 8:30-12:00,35.23961,-85.833139,United States,Marion County,US,PREMISE: ROOFTOP
Morrison Office,5248 Mancher Hwy,Morrison,TN,37357,(931) 668-7920,(931) 668-2931,M-Th 8:00-4:30 Fri 8:00-5:00 Sat 8:30-12:00,M-Th 8:00-04:30 Fri 8:00-05:00 Sat 8:30-12:00,35.6383446,-85.8431449,United States,Warren County,US,PREMISE: ROOFTOP
Palmer Office,711 Main Street,Palmer,TN,37365,(931) 779-3288,(931) 779-3280,M-Th 8:30-4:00 Fri 8:30-5:00,M-Th 8:30-04:00 Fri 8:30-05:00 Sat 8:30-12:00,35.371077,-85.569625,United States,Grundy County,US,PREMISE: ROOFTOP
Pikeville,3468 N Main St,Pikeville,TN,37367,(423) 447-2107,(423) 447-2180,M-Th 8:30-4:00 Fri 8:30-5:00 Sat 8:30-12:00,M-Th 8:00-4:00 Fri 8:00-5:00 Sat 8:00-12:00,35.610431,-85.1879,United States,Bledsoe County,US,PREMISE: ROOFTOP
Signal Mountain,1306 Taft Hwy,Signal Mtn.,TN,37377,(423) 886-2868,(423) 886-2898,M-Th 8:00-04:00 Fri 8:00-05:00 9:00-12:00 Sat,M-Th 7:00-4:00 Fri 7:00-05:00 9:00-12:00 Sat,35.140215,-85.327001,United States,Hamilton County,US,PREMISE: ROOFTOP
Alexian Village Office,437 Taft Hwy,Signal Mtn.,TN,37377,(423) 886-2868,(423) 886-2898,M & Th 9:00-2:00,,35.19401480000001,-85.3576355,United States,Sequatchie County,US,STREET_ADDRESS: RANGE_INTERPOLATED
Soddy Daisy,8575 Dayton Pike,Soddy Daisy,TN,37379,(423) 332-7110,(423) 332-7220,M-Th 8:00-04:00 Fri 8:00-06:00 Sat 8:00-12:00,M-Th 8:00-04:00 Fri 8:00-06:00 Sat 8:00-12:00,35.22395,-85.219251,United States,Hamilton County,US,PREMISE: ROOFTOP
