distributor_name,address,city,state,zip_code,phone_number,email_address,website_address,latitude,longitude,country,country_code,county,geo_accuracy
Joseph A Russo Md,315 Main St Ste 201,North Reading,MA,01864,(978) 207-0345,,,42.596742,-71.119883,United States,US,Middlesex County,PREMISE: ROOFTOP
Skin Md Laser & Cosmetic Group,400 Washington St,Norwell,MA,02061,(844) 754-6631,info@skinmd1.com,http://www.skinmd1.com,42.1595791152856,-70.8582825958729,United States,US,Plymouth County,AGGDATA_VERIFIED: ROOFTOP
Ananda Medical Aesthetics And Laser Spa,85 E Main St Ste B,Norton,MA,02766,(508) 952-2930,info@anandaesthetics.com,http://www.anandaesthetics.com,41.971831,-71.176908,United States,US,Bristol County,PREMISE: ROOFTOP
Kyma Med Spa,134 Washington St,Norwell,MA,02061,(781) 871-4200,info@kyma-antiagingcenter.com,https://www.kymaantiaging.com/,42.169555,-70.876477,United States,US,Plymouth County,PREMISE: ROOFTOP
Richard F Eisen Md,75 Washington St Ste 202,Norwell,MA,02061,,,,42.173649,-70.879221,United States,US,Plymouth County,PREMISE: ROOFTOP
Seth Jones Md,110 Long Pond Rd Ste 201,Plymouth,MA,02360,(508) 747-1322,anewyou@capeplasticsurgery.com,http://www.capeplasticsurgery.com,41.925459,-70.655469,United States,US,Plymouth County,PREMISE: ROOFTOP
Shanthalamd Medspa And Laser Center,194 Newbury St Ste 1,Peabody,MA,01960,(978) 854-5035,info@shanthalamd.com,http://www.shanthalamd.com,42.543917,-70.986554,United States,US,Essex County,PREMISE: ROOFTOP
Skin Md Laser & Cosmetic Group,2 1St Ave Ste 123,Peabody,MA,01960,(844) 754-6631,info@skinmd1.com,http://www.skinmd1.com,42.5196881,-70.9752985,United States,US,Essex County,SUBPREMISE: ROOFTOP
3D Medical Aesthetics,500 Victory Rd,Quincy,MA,02171,(617) 481-5948,contact@3dmedicalaesthetics.com,http://www.3dmedicalaesthetics.com,42.298457,-71.029971,United States,US,Norfolk County,PREMISE: ROOFTOP
Boston Plastic Surgery,2300 Crown Colony Dr #101,Quincy,MA,02169,(617) 786-7600,info@bostonplastic.com,http://www.bostonplastic.com,42.235362,-71.01845,United States,US,Norfolk County,PREMISE: ROOFTOP
