distributor_name,store_type,address,address_line_2,city,state,zip_code,phone_number,email_address,website_address,latitude,longitude,country,county,country_code,geo_accuracy
Jones Brothers Company Inc,Service,107 Park West Drive,,Scott,LA,70583,(337) 839-0807,jbc@jonesbrothers.com,http:\/\/www.jonesbrothers.com\/,30.24342808,-92.10065326,United States,Lafayette Parish,US,AGGDATA_VERIFIED: ROOFTOP
Rittiner Equipment Co Inc,Distributor,111 Credit Drive,,Scott,LA,70583,(337) 237-1440,Info@RittinerEquipment.com,http:\/\/www.rittinerdash.com\/,30.241046,-92.082975,United States,Lafayette Parish,US,PREMISE: ROOFTOP
Pump Masters Inc,Distributor,405 Creswell Avenue,,Shreveport,LA,71101,(318) 425-1557,,,32.5045664,-93.7398195,United States,Caddo Parish,US,PREMISE: ROOFTOP
Jones Brothers Company Inc,Distributor,9365 Highway 2,,West Farmerville,LA,71241,(318) 325-8110,jbc@jonesbrothers.com,http:\/\/www.jonesbrothers.com\/,32.7827672,-92.4489423,United States,Union Parish,US,STREET_ADDRESS: ROOFTOP
Jones Brothers Company Inc,Service,9365 Highway 2,,West Farmerville,LA,71241,(318) 325-8110,jbc@jonesbrothers.com,http:\/\/www.jonesbrothers.com\/,32.7827672,-92.4489423,United States,Union Parish,US,STREET_ADDRESS: ROOFTOP
Northeastern Petroleum Service And Supply,Distributor,37 Brookley Road,,Boston,MA,02130,(617) 522-8390,info@nepss.com,http:\/\/www.nepss.com\/,42.3040001,-71.1078548,United States,Suffolk County,US,STREET_ADDRESS: ROOFTOP
Northeastern Petroleum Service And Supply,Service,37 Brookley Road,,Boston,MA,02130,(617) 522-8390,info@nepss.com,http:\/\/www.nepss.com\/,42.3040001,-71.1078548,United States,Suffolk County,US,STREET_ADDRESS: ROOFTOP
Hall Trask Equip Co,Distributor,105 Roc Sam Park Road,,Braintree,MA,02184,(781) 380-8700,,,42.19502087929714,-71.03328064084053,United States,Norfolk County,US,AGGDATA_VERIFIED: ROOFTOP
Biermann Services Inc,Distributor,77 Fuller Road,,Chicopee,MA,01020,(800) 532-6573,sales@biermannsvcs.com,http:\/\/www.biermannsvcs.com\/,42.1677850571796,-72.57378224283458,United States,Hampden County,US,AGGDATA_VERIFIED: ROOFTOP
Biermann Services Inc,Service,77 Fuller Road,,Chicopee,MA,01020,(800) 532-6573,sales@biermannsvcs.com,http:\/\/www.biermannsvcs.com\/,42.1677850571796,-72.57378224283458,United States,Hampden County,US,AGGDATA_VERIFIED: ROOFTOP
